Reaction Details
TargetCannabinoid receptor 1
LigandBDBM50228072
Substrate/Competitorn/a
Meas. Tech.ChEMBL_560594 (CHEMBL1022319)
Ki 400±n/a nM
Citation Markt, PFeldmann, CRollinger, JMRaduner, SSchuster, DKirchmair, JDistinto, SSpitzer, GMWolber, GLaggner, CAltmann, KHLanger, TGertsch, J Discovery of novel CB2 receptor ligands by a pharmacophore-based virtual screening workflow. J Med Chem52:369-78 (2009) 
 
Cannabinoid receptor 1
Name:Cannabinoid receptor 1
Type:G Protein-Coupled Receptor (GPCR)
Mol. Mass.:52868.96
Organism:Homo sapiens (Human)
Description:P21554
Residue:472
BDBM50228072
NameBDBM50228072
Synonyms:1,9-dihydroxy-3-(1',1'-dimethylheptyl)-6H-benzo[c]chromene-6-one AM-1714 | CHEMBL429797
TypeSmall organic molecule
Emp. Form.C22H26O4
Mol. Mass.354.4394
SMILESCCCCCCC(C)(C)c1cc(O)c2c(c1)oc(=O)c1ccc(O)cc21