Reaction Details
TargetCannabinoid receptor 2
LigandBDBM50265747
Substrate/Competitorn/a
Meas. Tech.ChEMBL_560595 (CHEMBL1022320)
Ki 6.1±n/a nM
Citation Markt, PFeldmann, CRollinger, JMRaduner, SSchuster, DKirchmair, JDistinto, SSpitzer, GMWolber, GLaggner, CAltmann, KHLanger, TGertsch, J Discovery of novel CB2 receptor ligands by a pharmacophore-based virtual screening workflow. J Med Chem52:369-78 (2009) 
 
Cannabinoid receptor 2
Name:Cannabinoid receptor 2
Type:G Protein-Coupled Receptor (GPCR)
Mol. Mass.:39690.94
Organism:Homo sapiens (Human)
Description:P34972
Residue:360
BDBM50265747
NameBDBM50265747
Synonyms:(4-methylnaphthalen-1-yl)(1-propyl-1H-indol-3-yl)methanone JWH-120
TypeSmall organic molecule
Emp. Form.C23H21NO
Mol. Mass.327.4189
SMILESCCCn1cc(C(=O)c2ccc(C)c3ccccc23)c2ccccc12