Reaction Details
TargetCannabinoid receptor 1
LigandBDBM50265754
Substrate/Competitorn/a
Meas. Tech.ChEMBL_560594 (CHEMBL1022319)
Ki>10000±n/a nM
Citation Markt, PFeldmann, CRollinger, JMRaduner, SSchuster, DKirchmair, JDistinto, SSpitzer, GMWolber, GLaggner, CAltmann, KHLanger, TGertsch, J Discovery of novel CB2 receptor ligands by a pharmacophore-based virtual screening workflow. J Med Chem52:369-78 (2009) 
 
Cannabinoid receptor 1
Name:Cannabinoid receptor 1
Type:G Protein-Coupled Receptor (GPCR)
Mol. Mass.:52868.96
Organism:Homo sapiens (Human)
Description:P21554
Residue:472
BDBM50265754
NameBDBM50265754
Synonyms:(6-methoxynaphthalen-1-yl)(2-methyl-1-propyl-1H-indol-3-yl)methanone JWH-151
TypeSmall organic molecule
Emp. Form.C24H23NO2
Mol. Mass.357.4449
SMILESCCCn1c(C)c(C(=O)c2cccc3cc(OC)ccc23)c2ccccc12