Reaction Details
TargetCannabinoid receptor 2
LigandBDBM50265755
Substrate/Competitorn/a
Meas. Tech.ChEMBL_560595 (CHEMBL1022320)
Ki 18±n/a nM
Citation Markt, PFeldmann, CRollinger, JMRaduner, SSchuster, DKirchmair, JDistinto, SSpitzer, GMWolber, GLaggner, CAltmann, KHLanger, TGertsch, J Discovery of novel CB2 receptor ligands by a pharmacophore-based virtual screening workflow. J Med Chem52:369-78 (2009) 
 
Cannabinoid receptor 2
Name:Cannabinoid receptor 2
Type:G Protein-Coupled Receptor (GPCR)
Mol. Mass.:39690.94
Organism:Homo sapiens (Human)
Description:P34972
Residue:360
BDBM50265755
NameBDBM50265755
Synonyms:(6aR,10aR)-1-methoxy-6,6,9-trimethyl-3-(2-methylheptan-2-yl)-6a,7,8,10a-tetrahydro-6H-benzo[c]chromene JWH-229
TypeSmall organic molecule
Emp. Form.C25H38O2
Mol. Mass.370.568
SMILESCCCCCC(C)(C)c1cc(OC)c2[C@@H]3C=C(C)CC[C@H]3C(C)(C)Oc2c1