Reaction Details
TargetCannabinoid receptor 1
LigandBDBM50265647
Substrate/Competitorn/a
Meas. Tech.ChEMBL_560597 (CHEMBL1009869)
Ki 381±n/a nM
Citation Markt, PFeldmann, CRollinger, JMRaduner, SSchuster, DKirchmair, JDistinto, SSpitzer, GMWolber, GLaggner, CAltmann, KHLanger, TGertsch, J Discovery of novel CB2 receptor ligands by a pharmacophore-based virtual screening workflow. J Med Chem52:369-78 (2009) 
 
Cannabinoid receptor 1
Name:Cannabinoid receptor 1
Type:G Protein-Coupled Receptor (GPCR)
Mol. Mass.:52868.96
Organism:Homo sapiens (Human)
Description:P21554
Residue:472
BDBM50265647
NameBDBM50265647
Synonyms:(3-methoxynaphthalen-2-yl)(1-pentyl-1H-indol-3-yl)methanone JWH-26714
TypeSmall organic molecule
Emp. Form.C25H25NO2
Mol. Mass.371.4715
SMILESCCCCCn1cc(C(=O)c2cc3ccccc3cc2OC)c2ccccc12