Reaction Details
TargetCannabinoid receptor 1
LigandBDBM50265650
Substrate/Competitorn/a
Meas. Tech.ChEMBL_560594 (CHEMBL1022319)
Ki>50±n/a nM
Citation Markt, PFeldmann, CRollinger, JMRaduner, SSchuster, DKirchmair, JDistinto, SSpitzer, GMWolber, GLaggner, CAltmann, KHLanger, TGertsch, J Discovery of novel CB2 receptor ligands by a pharmacophore-based virtual screening workflow. J Med Chem52:369-78 (2009) 
 
Cannabinoid receptor 1
Name:Cannabinoid receptor 1
Type:G Protein-Coupled Receptor (GPCR)
Mol. Mass.:52868.96
Organism:Homo sapiens (Human)
Description:P21554
Residue:472
BDBM50265650
NameBDBM50265650
Synonyms:2-(N-(2,5-dimethoxyphenyl)-4-methylphenylsulfonamido)-N-(pyridin-4-ylmethyl)acetamide | CHEMBL522719
TypeSmall organic molecule
Emp. Form.C23H25N3O5S
Mol. Mass.455.527
SMILESCOc1ccc(OC)c(c1)N(CC(=O)NCc1ccncc1)S(=O)(=O)c1ccc(C)cc1