Reaction Details
TargetCannabinoid receptor 2
LigandBDBM50240608
Substrate/Competitorn/a
Meas. Tech.ChEMBL_560595 (CHEMBL1022320)
Ki 14±n/a nM
Citation Markt, PFeldmann, CRollinger, JMRaduner, SSchuster, DKirchmair, JDistinto, SSpitzer, GMWolber, GLaggner, CAltmann, KHLanger, TGertsch, J Discovery of novel CB2 receptor ligands by a pharmacophore-based virtual screening workflow. J Med Chem52:369-78 (2009) 
 
Cannabinoid receptor 2
Name:Cannabinoid receptor 2
Type:G Protein-Coupled Receptor (GPCR)
Mol. Mass.:39690.94
Organism:Homo sapiens (Human)
Description:P34972
Residue:360
BDBM50240608
NameBDBM50240608
Synonyms:2-(1-(2,3-dichlorobenzoyl)-5-methoxy-2-methyl-1H-indol-3-yl)-1-morpholinoethanone CHEMBL72374
TypeSmall organic molecule
Emp. Form.C23H22Cl2N2O4
Mol. Mass.461.338
SMILESCOc1ccc2n(C(=O)c3cccc(Cl)c3Cl)c(C)c(CC(=O)N3CCOCC3)c2c1