Reaction Details
TargetCannabinoid receptor 2
LigandBDBM50222788
Substrate/Competitorn/a
Meas. Tech.ChEMBL_560595 (CHEMBL1022320)
Ki 88.1±n/a nM
Citation Markt, PFeldmann, CRollinger, JMRaduner, SSchuster, DKirchmair, JDistinto, SSpitzer, GMWolber, GLaggner, CAltmann, KHLanger, TGertsch, J Discovery of novel CB2 receptor ligands by a pharmacophore-based virtual screening workflow. J Med Chem52:369-78 (2009) 
 
Cannabinoid receptor 2
Name:Cannabinoid receptor 2
Type:G Protein-Coupled Receptor (GPCR)
Mol. Mass.:39690.94
Organism:Homo sapiens (Human)
Description:P34972
Residue:360
BDBM50222788
NameBDBM50222788
Synonyms:1-(2-cyclopentyl-7-(4-methylpiperidine-1-carbonyl)-2,3-dihydropyrrolo[3,4-b]indol-4(1H)-yl)ethanone | CHEMBL400051
TypeSmall organic molecule
Emp. Form.C24H31N3O2
Mol. Mass.393.5218
SMILESCC1CCN(CC1)C(=O)c1ccc2n(C(C)=O)c3CN(Cc3c2c1)C1CCCC1