Reaction Details
TargetATP-binding cassette sub-family C member 2
LigandBDBM50244521
Substrate/Competitorn/a
Meas. Tech.ChEMBL_513493 (CHEMBL975399)
IC50 21500±n/a nM
Citation Leyers, SHäcker, HGWiendlocha, JGütschow, MWiese, M A 4-aminobenzoic acid derivative as novel lead for selective inhibitors of multidrug resistance-associated proteins. Bioorg Med Chem Lett18:4761-3 (2008) 
 
ATP-binding cassette sub-family C member 2
Name:ATP-binding cassette sub-family C member 2
Type:Protein
Mol. Mass.:174229.45
Organism:Homo sapiens (Human)
Description:Q92887
Residue:1545
BDBM50244521
NameBDBM50244521
Synonyms:(4-[(5,6,7,8-tetrahydro-4-oxo-4H-[1]benzothieno[2,3-d][1,3]thiazin-2-yl)amino]benzoicacid) | CHEMBL510556
TypeSmall organic molecule
Emp. Form.C17H14N2O3S2
Mol. Mass.358.435
SMILESOC(=O)c1ccc(Nc2nc3sc4CCCCc4c3c(=O)s2)cc1