Reaction Details
TargetCytochrome P450 26A1
LigandBDBM50253809
Substrate/Competitorn/a
Meas. Tech.ChEMBL_511280 (CHEMBL996935)
IC50 1500±n/a nM
Citation Gomaa, MSArmstrong, JLBobillon, BVeal, GJBrancale, ARedfern, CPSimons, C Novel azolyl-(phenylmethyl)]aryl/heteroarylamines: potent CYP26 inhibitors and enhancers of all-trans retinoic acid activity in neuroblastoma cells. Bioorg Med Chem16:8301-13 (2008) 
 
Cytochrome P450 26A1
Name:Cytochrome P450 26A1
Type:Enzyme
Mol. Mass.:56216.16
Organism:Homo sapiens (Human)
Description:O43174
Residue:497
BDBM50253809
NameBDBM50253809
Synonyms:Benzothiazol-2-yl-{4-[(5H-imidazol-1-yl)-phenylmethyl]-phenyl}-amine | CHEMBL460780
TypeSmall organic molecule
Emp. Form.C23H18N4S
Mol. Mass.382.481
SMILESN(c1nc2ccccc2s1)c1ccc(cc1)C(c1ccccc1)n1ccnc1