Reaction Details
TargetTranslocator protein
LigandBDBM22041
Substrate/Competitorn/a
Meas. Tech.ChEMBL_511514 (CHEMBL980957)
Ki 0.5±n/a nM
Citation Da Settimo, FSimorini, FTaliani, SLa Motta, CMarini, AMSalerno, SBellandi, MNovellino, EGreco, GCosimelli, BDa Pozzo, ECosta, BSimola, NMorelli, MMartini, C Anxiolytic-like effects of N,N-dialkyl-2-phenylindol-3-ylglyoxylamides by modulation of translocator protein promoting neurosteroid biosynthesis. J Med Chem51:5798-806 (2008) 
 
Translocator protein
Name:Translocator protein
Type:Mitochondrion membrane protein
Mol. Mass.:18945.84
Organism:Rattus norvegicus (rat)
Description:Competitive binding experiments were performed on rat kidney mitochondrial membranes.
Residue:169
BDBM22041
NameBDBM22041
Synonyms:2-[6-chloro-2-(4-chlorophenyl)imidazo[1,2-a]pyridin-3-yl]-N,N-dipropylacetamide Ananxyl S-800342
TypeSmall organic molecule
Emp. Form.C21H23Cl2N3O
Mol. Mass.404.333
SMILESCCCN(CCC)C(=O)Cc1c(nc2ccc(Cl)cn12)-c1ccc(Cl)cc1