Reaction Details
TargetTranslocator protein
LigandBDBM50253715
Substrate/Competitorn/a
Meas. Tech.ChEMBL_511514 (CHEMBL980957)
Ki 0.55±n/a nM
Citation Da Settimo, FSimorini, FTaliani, SLa Motta, CMarini, AMSalerno, SBellandi, MNovellino, EGreco, GCosimelli, BDa Pozzo, ECosta, BSimola, NMorelli, MMartini, C Anxiolytic-like effects of N,N-dialkyl-2-phenylindol-3-ylglyoxylamides by modulation of translocator protein promoting neurosteroid biosynthesis. J Med Chem51:5798-806 (2008) 
 
Translocator protein
Name:Translocator protein
Type:Mitochondrion membrane protein
Mol. Mass.:18945.84
Organism:Rattus norvegicus (rat)
Description:Competitive binding experiments were performed on rat kidney mitochondrial membranes.
Residue:169
BDBM50253715
NameBDBM50253715
Synonyms:CHEMBL518662 | N-benzyl-N-ethyl-2-(2-(4-nitrophenyl)-1H-indol-3-yl)-2-oxoacetamide
TypeSmall organic molecule
Emp. Form.C25H21N3O4
Mol. Mass.427.4519
SMILESCCN(Cc1ccccc1)C(=O)C(=O)c1c([nH]c2ccccc12)-c1ccc(cc1)[N+]([O-])=O