Reaction Details
TargetTranslocator protein
LigandBDBM50253681
Substrate/Competitorn/a
Meas. Tech.ChEMBL_511514 (CHEMBL980957)
Ki 1.3±n/a nM
Citation Da Settimo, FSimorini, FTaliani, SLa Motta, CMarini, AMSalerno, SBellandi, MNovellino, EGreco, GCosimelli, BDa Pozzo, ECosta, BSimola, NMorelli, MMartini, C Anxiolytic-like effects of N,N-dialkyl-2-phenylindol-3-ylglyoxylamides by modulation of translocator protein promoting neurosteroid biosynthesis. J Med Chem51:5798-806 (2008) 
 
Translocator protein
Name:Translocator protein
Type:Mitochondrion membrane protein
Mol. Mass.:18945.84
Organism:Rattus norvegicus (rat)
Description:Competitive binding experiments were performed on rat kidney mitochondrial membranes.
Residue:169
BDBM50253681
NameBDBM50253681
Synonyms:CHEMBL459313 | N-benzyl-2-(2-(4-chlorophenyl)-1H-indol-3-yl)-N-ethyl-2-oxoacetamide
TypeSmall organic molecule
Emp. Form.C25H21ClN2O2
Mol. Mass.416.899
SMILESCCN(Cc1ccccc1)C(=O)C(=O)c1c([nH]c2ccccc12)-c1ccc(Cl)cc1