Reaction Details
TargetTranslocator protein
LigandBDBM50253678
Substrate/Competitorn/a
Meas. Tech.ChEMBL_511514 (CHEMBL980957)
Ki 1.9±n/a nM
Citation Da Settimo, FSimorini, FTaliani, SLa Motta, CMarini, AMSalerno, SBellandi, MNovellino, EGreco, GCosimelli, BDa Pozzo, ECosta, BSimola, NMorelli, MMartini, C Anxiolytic-like effects of N,N-dialkyl-2-phenylindol-3-ylglyoxylamides by modulation of translocator protein promoting neurosteroid biosynthesis. J Med Chem51:5798-806 (2008) 
 
Translocator protein
Name:Translocator protein
Type:Mitochondrion membrane protein
Mol. Mass.:18945.84
Organism:Rattus norvegicus (rat)
Description:Competitive binding experiments were performed on rat kidney mitochondrial membranes.
Residue:169
BDBM50253678
NameBDBM50253678
Synonyms:CHEMBL459945 | N,N-dihexyl-2-(7-methyl-2-phenyl-1H-indol-3-yl)-2-oxoacetamide
TypeSmall organic molecule
Emp. Form.C29H38N2O2
Mol. Mass.446.6242
SMILESCCCCCCN(CCCCCC)C(=O)C(=O)c1c([nH]c2c(C)cccc12)-c1ccccc1