Reaction Details
TargetTranslocator protein
LigandBDBM50253483
Substrate/Competitorn/a
Meas. Tech.ChEMBL_511514 (CHEMBL980957)
Ki 0.23±n/a nM
Citation Da Settimo, FSimorini, FTaliani, SLa Motta, CMarini, AMSalerno, SBellandi, MNovellino, EGreco, GCosimelli, BDa Pozzo, ECosta, BSimola, NMorelli, MMartini, C Anxiolytic-like effects of N,N-dialkyl-2-phenylindol-3-ylglyoxylamides by modulation of translocator protein promoting neurosteroid biosynthesis. J Med Chem51:5798-806 (2008) 
 
Translocator protein
Name:Translocator protein
Type:Mitochondrion membrane protein
Mol. Mass.:18945.84
Organism:Rattus norvegicus (rat)
Description:Competitive binding experiments were performed on rat kidney mitochondrial membranes.
Residue:169
BDBM50253483
NameBDBM50253483
Synonyms:CHEMBL492686 | N,N-dihexyl-2-(2-(4-nitrophenyl)-1H-indol-3-yl)-2-oxoacetamide
TypeSmall organic molecule
Emp. Form.C28H35N3O4
Mol. Mass.477.5952
SMILESCCCCCCN(CCCCCC)C(=O)C(=O)c1c([nH]c2ccccc12)-c1ccc(cc1)[N+]([O-])=O