Reaction Details
TargetDelta-type opioid receptor
LigandBDBM50252953
Substrate/Competitorn/a
Meas. Tech.ChEMBL_534603 (CHEMBL989028)
EC50 1.4±n/a nM
Citation Le Bourdonnec, BWindh, RTAjello, CWLeister, LKGu, MChu, GHTuthill, PABarker, WMKoblish, MWiant, DDGraczyk, TMBelanger, SCassel, JAFeschenko, MSBrogdon, BLSmith, SAChrist, DDDerelanko, MJKutz, SLittle, PJDeHaven, RNDeHaven-Hudkins, DLDolle, RE Potent, orally bioavailable delta opioid receptor agonists for the treatment of pain: discovery of N,N-diethyl-4-(5-hydroxyspiro[chromene-2,4'-piperidine]-4-yl)benzamide (ADL5859). J Med Chem51:5893-6 (2008) 
 
Delta-type opioid receptor
Name:Delta-type opioid receptor
Type:G Protein-Coupled Receptor (GPCR)
Mol. Mass.:40382.98
Organism:Homo sapiens (Human)
Description:Competition binding assays were carried out using membrane preparations from transfected HN9.10 cells that constitutively expressed the delta opioid receptor.
Residue:372
BDBM50252953
NameBDBM50252953
Synonyms:CHEMBL494479 | N,N-Diethyl-4-(6-hydroxyspiro[chromene-2,4'-piperidine]-4-yl)benzamide
TypeSmall organic molecule
Emp. Form.C24H28N2O3
Mol. Mass.392.4907
SMILESCCN(CC)C(=O)c1ccc(cc1)C1=CC2(CCNCC2)Oc2ccc(O)cc12