Reaction Details
TargetKappa-type opioid receptor
LigandBDBM50039026
Substrate/Competitorn/a
Meas. Tech.ChEMBL_534604 (CHEMBL989029)
Ki 130±n/a nM
Citation Le Bourdonnec, BWindh, RTAjello, CWLeister, LKGu, MChu, GHTuthill, PABarker, WMKoblish, MWiant, DDGraczyk, TMBelanger, SCassel, JAFeschenko, MSBrogdon, BLSmith, SAChrist, DDDerelanko, MJKutz, SLittle, PJDeHaven, RNDeHaven-Hudkins, DLDolle, RE Potent, orally bioavailable delta opioid receptor agonists for the treatment of pain: discovery of N,N-diethyl-4-(5-hydroxyspiro[chromene-2,4'-piperidine]-4-yl)benzamide (ADL5859). J Med Chem51:5893-6 (2008) 
 
Kappa-type opioid receptor
Name:Kappa-type opioid receptor
Type:G Protein-Coupled Receptor (GPCR)
Mol. Mass.:42648.76
Organism:Homo sapiens (Human)
Description:P41145
Residue:380
BDBM50039026
NameBDBM50039026
Synonyms:4-((R)-((2S,5R)-4-allyl-2,5-dimethylpiperazin-1-yl)(3-hydroxyphenyl)methyl)-N,N-diethylbenzamide 4-[(4-Allyl-2,5-dimethyl-piperazin-1-yl)-(3-hydroxy-phenyl)-methyl]-N,N-diethyl-benzamide(SNC-86) BW-373U86 SNC-86
TypeSmall organic molecule
Emp. Form.C27H37N3O2
Mol. Mass.435.6016
SMILESCCN(CC)C(=O)c1ccc(cc1)[C@@H](N1C[C@@H](C)N(CC=C)C[C@@H]1C)c1cccc(O)c1