Reaction Details
TargetKappa-type opioid receptor
LigandBDBM50252830
Substrate/Competitorn/a
Meas. Tech.ChEMBL_534636 (CHEMBL993333)
Ki 3400±n/a nM
Citation Le Bourdonnec, BWindh, RTAjello, CWLeister, LKGu, MChu, GHTuthill, PABarker, WMKoblish, MWiant, DDGraczyk, TMBelanger, SCassel, JAFeschenko, MSBrogdon, BLSmith, SAChrist, DDDerelanko, MJKutz, SLittle, PJDeHaven, RNDeHaven-Hudkins, DLDolle, RE Potent, orally bioavailable delta opioid receptor agonists for the treatment of pain: discovery of N,N-diethyl-4-(5-hydroxyspiro[chromene-2,4'-piperidine]-4-yl)benzamide (ADL5859). J Med Chem51:5893-6 (2008) 
 
Kappa-type opioid receptor
Name:Kappa-type opioid receptor
Type:G Protein-Coupled Receptor (GPCR)
Mol. Mass.:42648.76
Organism:Homo sapiens (Human)
Description:P41145
Residue:380
BDBM50252830
NameBDBM50252830
Synonyms:4-Phenylspiro[chromene-2,4'-piperidine] | CHEMBL492447
TypeSmall organic molecule
Emp. Form.C19H19NO
Mol. Mass.277.3603
SMILESC1CC2(CCN1)Oc1ccccc1C(=C2)c1ccccc1