Reaction Details
TargetSolute carrier family 22 member 1
LigandBDBM77970
Substrate/Competitorn/a
Meas. Tech.ChEMBL_534654 (CHEMBL994103)
IC50 19300±n/a nM
Citation Ahlin, GKarlsson, JPedersen, JMGustavsson, LLarsson, RMatsson, PNorinder, UBergström, CAArtursson, P Structural requirements for drug inhibition of the liver specific human organic cation transport protein 1. J Med Chem51:5932-42 (2008) 
 
Solute carrier family 22 member 1
Name:Solute carrier family 22 member 1
Type:Enzyme Catalytic Domain
Mol. Mass.:61154.85
Organism:Homo sapiens (Human)
Description:Adrenergic Alpha 0 HUMAN::O15245
Residue:554
BDBM77970
NameBDBM77970
Synonyms:3-(2-chloranyl-5,6-dihydrobenzo[b][1]benzazepin-11-yl)-N,N-dimethyl-propan-1-amine;hydrochloride 3-(2-chloro-5,6-dihydrobenzo[b][1]benzazepin-11-yl)-N,N-dimethylpropan-1-amine;hydrochloride CHLORIMIPRAMINE CLOMIPRAMINE HYDROCHLORIDE MLS000028511 cid_68539 | med.21724, Compound Clomipramine
TypeSmall organic molecule
Emp. Form.C19H23ClN2
Mol. Mass.314.852
SMILESCN(C)CCCN1c2ccccc2CCc2ccc(Cl)cc12