Reaction Details
TargetSolute carrier family 22 member 1
LigandBDBM50169808
Substrate/Competitorn/a
Meas. Tech.ChEMBL_534654 (CHEMBL994103)
IC50 27200±n/a nM
Citation Ahlin, GKarlsson, JPedersen, JMGustavsson, LLarsson, RMatsson, PNorinder, UBergström, CAArtursson, P Structural requirements for drug inhibition of the liver specific human organic cation transport protein 1. J Med Chem51:5932-42 (2008) 
 
Solute carrier family 22 member 1
Name:Solute carrier family 22 member 1
Type:Enzyme Catalytic Domain
Mol. Mass.:61154.85
Organism:Homo sapiens (Human)
Description:Adrenergic Alpha 0 HUMAN::O15245
Residue:554
BDBM50169808
NameBDBM50169808
Synonyms:2-{2-Hydroxy-3-[2-(1H-indol-3-yl)-1,1-dimethyl-ethylamino]-propoxy}-benzamide BUCINDOLOL | CHEMBL321582
TypeSmall organic molecule
Emp. Form.C22H25N3O2
Mol. Mass.363.4528
SMILESCC(C)(Cc1c[nH]c2ccccc12)NCC(O)COc1ccccc1C#N