Reaction Details
TargetSolute carrier family 22 member 1
LigandBDBM50020712
Substrate/Competitorn/a
Meas. Tech.ChEMBL_534654 (CHEMBL994103)
IC50 16900±n/a nM
Citation Ahlin, GKarlsson, JPedersen, JMGustavsson, LLarsson, RMatsson, PNorinder, UBergström, CAArtursson, P Structural requirements for drug inhibition of the liver specific human organic cation transport protein 1. J Med Chem51:5932-42 (2008) 
 
Solute carrier family 22 member 1
Name:Solute carrier family 22 member 1
Type:Enzyme Catalytic Domain
Mol. Mass.:61154.85
Organism:Homo sapiens (Human)
Description:Adrenergic Alpha 0 HUMAN::O15245
Residue:554
BDBM50020712
NameBDBM50020712
Synonyms:10,11-dihydro-5-(gamma-dimethylaminopropylidene)-5H-dibenzo(a,d)cycloheptene 3-(10,11-dihydro-5H-dibenzo(a,d)cyclohepten-5-ylidene)-N,N-dimethyl-1-propanamine 3-(10,11-dihydro-5H-dibenzo[a,d]cyclohepten-5-ylidene)-N,N-dimethylpropan-1-amine 5-(3-dimethylaminopropylidene)-10,11-dihydro-5H-dibenzo(a,d)cycloheptene AMITRIPTYLINE CHEMBL629
TypeSmall organic molecule
Emp. Form.C20H23N
Mol. Mass.277.4033
SMILES[#6]-[#7](-[#6])-[#6]-[#6]\[#6]=[#6]-1/c2ccccc2-[#6]-[#6]-c2ccccc-12