Reaction Details
TargetSolute carrier family 22 member 1
LigandBDBM50017698
Substrate/Competitorn/a
Meas. Tech.ChEMBL_534654 (CHEMBL994103)
IC50 23700±n/a nM
Citation Ahlin, GKarlsson, JPedersen, JMGustavsson, LLarsson, RMatsson, PNorinder, UBergström, CAArtursson, P Structural requirements for drug inhibition of the liver specific human organic cation transport protein 1. J Med Chem51:5932-42 (2008) 
 
Solute carrier family 22 member 1
Name:Solute carrier family 22 member 1
Type:Enzyme Catalytic Domain
Mol. Mass.:61154.85
Organism:Homo sapiens (Human)
Description:Adrenergic Alpha 0 HUMAN::O15245
Residue:554
BDBM50017698
NameBDBM50017698
Synonyms:4-(4-(4-chlorophenyl)-4-hydroxypiperidin-1-yl)-N,N-dimethyl-2,2-diphenylbutanamide 4-[4-(4-Chloro-phenyl)-4-hydroxy-piperidin-1-yl]-N,N-dimethyl-2,2-diphenyl-butyramide(loperamide) Imodium LOPERAMIDE HYDROCHLORIDE med.21724, Compound 184
TypeSmall organic molecule
Emp. Form.C29H33ClN2O2
Mol. Mass.477.038
SMILESCN(C)C(=O)C(CCN1CCC(O)(CC1)c1ccc(Cl)cc1)(c1ccccc1)c1ccccc1