Reaction Details
TargetSolute carrier family 22 member 1
LigandBDBM50028893
Substrate/Competitorn/a
Meas. Tech.ChEMBL_534654 (CHEMBL994103)
IC50 81700±n/a nM
Citation Ahlin, GKarlsson, JPedersen, JMGustavsson, LLarsson, RMatsson, PNorinder, UBergström, CAArtursson, P Structural requirements for drug inhibition of the liver specific human organic cation transport protein 1. J Med Chem51:5932-42 (2008) 
 
Solute carrier family 22 member 1
Name:Solute carrier family 22 member 1
Type:Enzyme Catalytic Domain
Mol. Mass.:61154.85
Organism:Homo sapiens (Human)
Description:Adrenergic Alpha 0 HUMAN::O15245
Residue:554
BDBM50028893
NameBDBM50028893
Synonyms:4-(diisopropylamino)-2-phenyl-2-pyridin-2-ylbutanamide DISOPYRAMIDE gamma-Diisopropylamino-alpha-phenyl-alpha-(2-pyridyl)butyramide
TypeSmall organic molecule
Emp. Form.C21H29N3O
Mol. Mass.339.4745
SMILESCC(C)N(CCC(C(N)=O)(c1ccccc1)c1ccccn1)C(C)C