Reaction Details
TargetTyrosine-protein phosphatase non-receptor type 1
LigandBDBM50346613
Substrate/Competitorn/a
Meas. Tech.ChEMBL_539060 (CHEMBL1036591)
IC50 3500±n/a nM
Citation Thuong, PTLee, CHDao, TTNguyen, PHKim, WGLee, SJOh, WK Triterpenoids from the leaves of Diospyros kaki (persimmon) and their inhibitory effects on protein tyrosine phosphatase 1B. J Nat Prod71:1775-8 (2008) 
 
Tyrosine-protein phosphatase non-receptor type 1
Name:Tyrosine-protein phosphatase non-receptor type 1
Type:Protein phosphatase
Mol. Mass.:49963.76
Organism:Homo sapiens (Human)
Description:Human recombinant GST-fusion PTP1B (1-435).
Residue:435
BDBM50346613
NameBDBM50346613
Synonyms:CHEMBL470029 | Oleanonic Acid
TypeSmall organic molecule
Emp. Form.C30H46O3
Mol. Mass.454.6844
SMILESCC1(C)CC[C@@]2(CC[C@]3(C)C(=CC[C@@H]4[C@@]5(C)CCC(=O)C(C)(C)[C@@H]5CC[C@@]34C)[C@@H]2C1)C(O)=O