Reaction Details
TargetTyrosine-protein phosphatase non-receptor type 1
LigandBDBM50253027
Substrate/Competitorn/a
Meas. Tech.ChEMBL_539060 (CHEMBL1036591)
IC50>30000±n/a nM
Citation Thuong, PTLee, CHDao, TTNguyen, PHKim, WGLee, SJOh, WK Triterpenoids from the leaves of Diospyros kaki (persimmon) and their inhibitory effects on protein tyrosine phosphatase 1B. J Nat Prod71:1775-8 (2008) 
 
Tyrosine-protein phosphatase non-receptor type 1
Name:Tyrosine-protein phosphatase non-receptor type 1
Type:Protein phosphatase
Mol. Mass.:49963.76
Organism:Homo sapiens (Human)
Description:Human recombinant GST-fusion PTP1B (1-435).
Residue:435
BDBM50253027
NameBDBM50253027
Synonyms:3alpha,19alpha-dihydroxyurs-12,20(30)-dien-24,28-dioic acid | CHEMBL521997
TypeSmall organic molecule
Emp. Form.C30H44O6
Mol. Mass.500.6668
SMILESC[C@]1(O)[C@H]2C3=CC[C@@H]4[C@@]5(C)CC[C@@H](O)[C@@](C)([C@@H]5CC[C@@]4(C)[C@]3(C)CC[C@]2(CCC1=C)C(O)=O)C(O)=O