Reaction Details
TargetMelanocortin receptor 3
LigandBDBM50252900
Substrate/Competitorn/a
Meas. Tech.ChEMBL_539389 (CHEMBL1027273)
Ki 350±n/a nM
Citation Proneth, BPogozheva, IDPortillo, FPMosberg, HIHaskell-Luevano, C Melanocortin tetrapeptide Ac-His-DPhe-Arg-Trp-NH2 modified at the para position of the benzyl side chain (DPhe): importance for mouse melanocortin-3 receptor agonist versus antagonist activity. J Med Chem51:5585-93 (2008) 
 
Melanocortin receptor 3
Name:Melanocortin receptor 3
Type:PROTEIN
Mol. Mass.:35808.24
Organism:Mus musculus
Description:ChEMBL_1498848
Residue:323
BDBM50252900
NameBDBM50252900
Synonyms:Ac-His-DPhe(pBr)-Arg-Trp-NH2 | CHEMBL502093
TypeSmall organic molecule
Emp. Form.C34H42BrN11O5
Mol. Mass.764.672
SMILESCC(=O)N[C@@H](Cc1cnc[nH]1)C(=O)N[C@H](Cc1ccc(Br)cc1)C(=O)N[C@@H](CCCN=C(N)N)C(=O)N[C@@H](Cc1c[nH]c2ccccc12)C(N)=O