Reaction Details
TargetMelanocortin receptor 3
LigandBDBM50115373
Substrate/Competitorn/a
Meas. Tech.ChEMBL_539389 (CHEMBL1027273)
Ki 260±n/a nM
Citation Proneth, BPogozheva, IDPortillo, FPMosberg, HIHaskell-Luevano, C Melanocortin tetrapeptide Ac-His-DPhe-Arg-Trp-NH2 modified at the para position of the benzyl side chain (DPhe): importance for mouse melanocortin-3 receptor agonist versus antagonist activity. J Med Chem51:5585-93 (2008) 
 
Melanocortin receptor 3
Name:Melanocortin receptor 3
Type:PROTEIN
Mol. Mass.:35808.24
Organism:Mus musculus
Description:ChEMBL_1498848
Residue:323
BDBM50115373
NameBDBM50115373
Synonyms:2-[2-[2-Acetylamino-3-(3H-imidazol-4-yl)-propionylamino]-3-(4-iodo-phenyl)-propionylamino]-5-guanidino-pentanoic acid [1-carbamoyl-2-(1H-indol-3-yl)-ethyl]-amide CHEMBL322610
TypeSmall organic molecule
Emp. Form.C34H42IN11O5
Mol. Mass.811.6725
SMILESCC(=O)N[C@@H](Cc1cnc[nH]1)C(=O)N[C@H](Cc1ccc(I)cc1)C(=O)N[C@@H](CCCN=C(N)N)C(=O)N[C@@H](Cc1c[nH]c2ccccc12)C(N)=O