Reaction Details
TargetMelanocortin receptor 4
LigandBDBM50121900
Substrate/Competitorn/a
Meas. Tech.ChEMBL_539391 (CHEMBL1027275)
EC50 0.12±n/a nM
Citation Proneth, BPogozheva, IDPortillo, FPMosberg, HIHaskell-Luevano, C Melanocortin tetrapeptide Ac-His-DPhe-Arg-Trp-NH2 modified at the para position of the benzyl side chain (DPhe): importance for mouse melanocortin-3 receptor agonist versus antagonist activity. J Med Chem51:5585-93 (2008) 
 
Melanocortin receptor 4
Name:Melanocortin receptor 4
Type:PROTEIN
Mol. Mass.:36964.43
Organism:Mus musculus
Description:ChEMBL_1498850
Residue:332
BDBM50121900
NameBDBM50121900
Synonyms:Ac-Ser-Try-Ser-Nle-Glu-His-DPhe-Arg-Trp-Gly-Lys-Pro-Val-NH2 | CHEMBL439490
TypeSmall organic molecule
Emp. Form.C78H111N21O19
Mol. Mass.1646.8452
SMILESCCCC[C@H](NC(=O)C(CO)NC(=O)[C@H](Cc1ccc(O)cc1)NC(=O)[C@H](CO)NC(C)=O)C(=O)N[C@@H](CCC(O)=O)C(=O)N[C@@H](Cc1cnc[nH]1)C(=O)N[C@H](Cc1ccccc1)C(=O)N[C@@H](CCCNC(N)=N)C(=O)N[C@@H](Cc1c[nH]c2ccccc12)C(=O)NCC(=O)N[C@@H](CCCCN)C(=O)N1CCC[C@@H]1C(=O)N[C@H](C(C)C)C(N)=O