Reaction Details
TargetDNA polymerase beta
LigandBDBM50253100
Substrate/Competitorn/a
Meas. Tech.ChEMBL_539183 (CHEMBL1024687)
Ki 900±n/a nM
Citation Liang, FJain, NHutchens, TShock, DDBeard, WAWilson, SHChiarelli, MPCho, BP Alpha,beta-methylene-2'-deoxynucleoside 5'-triphosphates as noncleavable substrates for DNA polymerases: isolation, characterization, and stability studies of novel 2'-deoxycyclonucleosides, 3,5'-cyclo-dG, and 2,5'-cyclo-dT. J Med Chem51:6460-70 (2008) 
 
DNA polymerase beta
Name:DNA polymerase beta
Type:Protein
Mol. Mass.:38188.76
Organism:Homo sapiens (Human)
Description:n/a
Residue:335
BDBM50253100
NameBDBM50253100
Synonyms:[(2R,3S,5R)-5-(4-amino-2-oxo-1,2-dihydropyrimidin-1-yl)-3-hydroxyoxolan-2-yl]methyl {[(phosphonatooxy)phosphinato]methyl}phosphonate
TypeSmall organic molecule
Emp. Form.C10H14N3O12P3
Mol. Mass.461.1545
SMILESNc1ccn([C@H]2C[C@H](O)[C@@H](COP([O-])(=O)CP([O-])(=O)OP([O-])([O-])=O)O2)c(=O)n1