Reaction Details
TargetGlutamate receptor 2
LigandBDBM50060635
Substrate/Competitorn/a
Meas. Tech.ChEMBL_539472 (CHEMBL1028968)
Ki 4±n/a nM
Citation Butini, SPickering, DSMorelli, ECoccone, SSTrotta, FDe Angelis, MGuarino, EFiorini, ICampiani, GNovellino, ESchousboe, AChristensen, JKGemma, S 1H-cyclopentapyrimidine-2,4(1H,3H)-dione-related ionotropic glutamate receptors ligands. structure-activity relationships and identification of potent and Selective iGluR5 modulators. J Med Chem51:6614-8 (2008) 
 
Glutamate receptor 2
Name:Glutamate receptor 2
Type:PROTEIN
Mol. Mass.:98691.74
Organism:Rattus norvegicus
Description:ChEMBL_936441
Residue:883
BDBM50060635
NameBDBM50060635
Synonyms:(S)-2-Amino-3-(5-fluoro-2,4-dioxo-3,4-dihydro-2H-pyrimidin-1-yl)-propionic acid (S)-5-Fluorowillardiine CHEMBL123132 | Fluorowillardiine
TypeSmall organic molecule
Emp. Form.C7H8FN3O4
Mol. Mass.217.1545
SMILESN[C@@H](Cn1cc(F)c(=O)[nH]c1=O)C(O)=O