Reaction Details
TargetFatty-acid amide hydrolase 1 [30-579]
LigandBDBM26736
Substrate/Competitorn/a
Meas. Tech.ChEMBL_494694 (CHEMBL938653)
IC50 12.4±n/a nM
Citation Seierstad, MBreitenbucher, JG Discovery and development of fatty acid amide hydrolase (FAAH) inhibitors. J Med Chem51:7327-43 (2009) 
 
Fatty-acid amide hydrolase 1 [30-579]
Name:Fatty-acid amide hydrolase 1 [30-579]
Type:Single-pass membrane protein; homodimer
Mol. Mass.:60474.00
Organism:Rattus norvegicus (rat)
Description:P97612 (aa 30-579)
Residue:550
BDBM26736
NameBDBM26736
Synonyms:CHEMBL509860 N,N-dimethyl-5-[(4-phenylphenyl)methyl]-1H-1,2,3,4-tetrazole-1-carboxamide
TypeSmall organic molecule
Emp. Form.C17H17N5O
Mol. Mass.307.3498
SMILESCN(C)C(=O)n1nnnc1Cc1ccc(cc1)-c1ccccc1