Reaction Details
TargetFatty-acid amide hydrolase 1
LigandBDBM22319
Substrate/Competitorn/a
Meas. Tech.ChEMBL_494689 (CHEMBL938648)
IC50>100000±n/a nM
Citation Seierstad, MBreitenbucher, JG Discovery and development of fatty acid amide hydrolase (FAAH) inhibitors. J Med Chem51:7327-43 (2009) 
 
Fatty-acid amide hydrolase 1
Name:Fatty-acid amide hydrolase 1
Type:Protein
Mol. Mass.:63071.19
Organism:Homo sapiens (Human)
Description:O00519
Residue:579
BDBM22319
NameBDBM22319
Synonyms:(5Z,8Z,11Z,14Z)-icosa-5,8,11,14-tetraenoic acid Arachidonic acid (AA) [1-14C]Arachidonic acid
TypeUnsaturated fatty acid
Emp. Form.C20H32O2
Mol. Mass.304.4669
SMILESCCCCC\C=C/C\C=C/C\C=C/C\C=C/CCCC(O)=O