Reaction Details
TargetNeuronal acetylcholine receptor subunit alpha-7
LigandBDBM50275263
Substrate/Competitorn/a
Meas. Tech.ChEMBL_494699 (CHEMBL938658)
Ki>1000000±n/a nM
Citation Hansen, CPJensen, AAChristensen, JKBalle, TLiljefors, TFrølund, B Novel acetylcholine and carbamoylcholine analogues: development of a functionally selective alpha4beta2 nicotinic acetylcholine receptor agonist. J Med Chem51:7380-95 (2009) 
 
Neuronal acetylcholine receptor subunit alpha-7
Name:Neuronal acetylcholine receptor subunit alpha-7
Type:Enzyme
Mol. Mass.:56502.44
Organism:Rattus norvegicus (Rat)
Description:Q05941
Residue:502
BDBM50275263
NameBDBM50275263
Synonyms:3-(dimethylamino) butyl pyrrolidine-1-carboxylate | CHEMBL486573
TypeSmall organic molecule
Emp. Form.C11H22N2O2
Mol. Mass.214.3046
SMILESCC(CCOC(=O)N1CCCC1)N(C)C