Reaction Details
TargetNeuronal acetylcholine receptor subunit alpha-7
LigandBDBM50275265
Substrate/Competitorn/a
Meas. Tech.ChEMBL_494699 (CHEMBL938658)
Ki>1000000±n/a nM
Citation Hansen, CPJensen, AAChristensen, JKBalle, TLiljefors, TFrølund, B Novel acetylcholine and carbamoylcholine analogues: development of a functionally selective alpha4beta2 nicotinic acetylcholine receptor agonist. J Med Chem51:7380-95 (2009) 
 
Neuronal acetylcholine receptor subunit alpha-7
Name:Neuronal acetylcholine receptor subunit alpha-7
Type:Enzyme
Mol. Mass.:56502.44
Organism:Rattus norvegicus (Rat)
Description:Q05941
Residue:502
BDBM50275265
NameBDBM50275265
Synonyms:3-((Azetidine-1-carbonyloxy)-1-methylpropyl)dimethylammonium Oxalate | CHEMBL486774
TypeSmall organic molecule
Emp. Form.C10H20N2O2
Mol. Mass.200.278
SMILESCC(CCOC(=O)N1CCC1)N(C)C