Reaction Details
TargetNeuronal acetylcholine receptor subunit alpha-4
LigandBDBM50275308
Substrate/Competitorn/a
Meas. Tech.ChEMBL_494698 (CHEMBL938657)
Ki 760±n/a nM
Citation Hansen, CPJensen, AAChristensen, JKBalle, TLiljefors, TFrølund, B Novel acetylcholine and carbamoylcholine analogues: development of a functionally selective alpha4beta2 nicotinic acetylcholine receptor agonist. J Med Chem51:7380-95 (2009) 
 
Neuronal acetylcholine receptor subunit alpha-4
Name:Neuronal acetylcholine receptor subunit alpha-4
Type:Enzyme
Mol. Mass.:70196.44
Organism:Rattus norvegicus (Rat)
Description:P09483
Residue:630
BDBM50275308
NameBDBM50275308
Synonyms:3-((Isobutyryloxy)-1-methylpropyl)dimethylammonium Oxalate | CHEMBL487350
TypeSmall organic molecule
Emp. Form.C10H21NO2
Mol. Mass.187.2792
SMILESCC(C)C(=O)OCCC(C)N(C)C