Reaction Details
TargetNeuronal acetylcholine receptor subunit alpha-3
LigandBDBM50275303
Substrate/Competitorn/a
Meas. Tech.ChEMBL_494697 (CHEMBL938656)
Ki 100000±n/a nM
Citation Hansen, CPJensen, AAChristensen, JKBalle, TLiljefors, TFrølund, B Novel acetylcholine and carbamoylcholine analogues: development of a functionally selective alpha4beta2 nicotinic acetylcholine receptor agonist. J Med Chem51:7380-95 (2009) 
 
Neuronal acetylcholine receptor subunit alpha-3
Name:Neuronal acetylcholine receptor subunit alpha-3
Type:Enzyme
Mol. Mass.:56995.52
Organism:Rattus norvegicus (Rat)
Description:P04757
Residue:499
BDBM50275303
NameBDBM50275303
Synonyms:(S)-3-((3-Methylazetidine-1-carbonyloxy)-1-methylpropyl)dimethylammonium Oxalate | CHEMBL488379
TypeSmall organic molecule
Emp. Form.C11H22N2O2
Mol. Mass.214.3046
SMILESC[C@@H](CCOC(=O)N1CC(C)C1)N(C)C