Reaction Details
TargetNeuronal acetylcholine receptor subunit alpha-4
LigandBDBM50275305
Substrate/Competitorn/a
Meas. Tech.ChEMBL_494696 (CHEMBL938655)
Ki 210±n/a nM
Citation Hansen, CPJensen, AAChristensen, JKBalle, TLiljefors, TFrølund, B Novel acetylcholine and carbamoylcholine analogues: development of a functionally selective alpha4beta2 nicotinic acetylcholine receptor agonist. J Med Chem51:7380-95 (2009) 
 
Neuronal acetylcholine receptor subunit alpha-4
Name:Neuronal acetylcholine receptor subunit alpha-4
Type:Enzyme
Mol. Mass.:70196.44
Organism:Rattus norvegicus (Rat)
Description:P09483
Residue:630
BDBM50275305
NameBDBM50275305
Synonyms:3-((2,2-Dimethylazetidine-1-carbonyloxy)-1-methylpropyl)dimethylammonium Oxalate | CHEMBL528765
TypeSmall organic molecule
Emp. Form.C12H24N2O2
Mol. Mass.228.3312
SMILESCC(CCOC(=O)N1CCC1(C)C)N(C)C