Reaction Details
TargetNeuronal acetylcholine receptor subunit alpha-7
LigandBDBM50275305
Substrate/Competitorn/a
Meas. Tech.ChEMBL_494699 (CHEMBL938658)
Ki>1000000±n/a nM
Citation Hansen, CPJensen, AAChristensen, JKBalle, TLiljefors, TFrølund, B Novel acetylcholine and carbamoylcholine analogues: development of a functionally selective alpha4beta2 nicotinic acetylcholine receptor agonist. J Med Chem51:7380-95 (2009) 
 
Neuronal acetylcholine receptor subunit alpha-7
Name:Neuronal acetylcholine receptor subunit alpha-7
Type:Enzyme
Mol. Mass.:56502.44
Organism:Rattus norvegicus (Rat)
Description:Q05941
Residue:502
BDBM50275305
NameBDBM50275305
Synonyms:3-((2,2-Dimethylazetidine-1-carbonyloxy)-1-methylpropyl)dimethylammonium Oxalate | CHEMBL528765
TypeSmall organic molecule
Emp. Form.C12H24N2O2
Mol. Mass.228.3312
SMILESCC(CCOC(=O)N1CCC1(C)C)N(C)C