Reaction Details
TargetNeuronal acetylcholine receptor subunit alpha-4
LigandBDBM50275306
Substrate/Competitorn/a
Meas. Tech.ChEMBL_494696 (CHEMBL938655)
Ki 310±n/a nM
Citation Hansen, CPJensen, AAChristensen, JKBalle, TLiljefors, TFrølund, B Novel acetylcholine and carbamoylcholine analogues: development of a functionally selective alpha4beta2 nicotinic acetylcholine receptor agonist. J Med Chem51:7380-95 (2009) 
 
Neuronal acetylcholine receptor subunit alpha-4
Name:Neuronal acetylcholine receptor subunit alpha-4
Type:Enzyme
Mol. Mass.:70196.44
Organism:Rattus norvegicus (Rat)
Description:P09483
Residue:630
BDBM50275306
NameBDBM50275306
Synonyms:3-((1H-Pyrrole-1-carbonyloxy)-1-methylpropyl)dimethylammonium Oxalate | CHEMBL488381
TypeSmall organic molecule
Emp. Form.C11H18N2O2
Mol. Mass.210.2728
SMILESCC(CCOC(=O)n1cccc1)N(C)C