Reaction Details
TargetNeuronal acetylcholine receptor subunit alpha-4
LigandBDBM50274819
Substrate/Competitorn/a
Meas. Tech.ChEMBL_494696 (CHEMBL938655)
Ki 3.8±n/a nM
Citation Hansen, CPJensen, AAChristensen, JKBalle, TLiljefors, TFrølund, B Novel acetylcholine and carbamoylcholine analogues: development of a functionally selective alpha4beta2 nicotinic acetylcholine receptor agonist. J Med Chem51:7380-95 (2009) 
 
Neuronal acetylcholine receptor subunit alpha-4
Name:Neuronal acetylcholine receptor subunit alpha-4
Type:Enzyme
Mol. Mass.:70196.44
Organism:Rattus norvegicus (Rat)
Description:P09483
Residue:630
BDBM50274819
NameBDBM50274819
Synonyms:3-((Cyclopropanecarbonyloxy)-1-methylpropyl)dimethylammonium Oxalate | CHEMBL457737
TypeSmall organic molecule
Emp. Form.C10H19NO2
Mol. Mass.185.2634
SMILESCC(CCOC(=O)C1CC1)N(C)C