Reaction Details
TargetTyrosine-protein phosphatase non-receptor type 1
LigandBDBM50274831
Substrate/Competitorn/a
Meas. Tech.ChEMBL_495918 (CHEMBL995832)
IC50 13900±n/a nM
Citation Cui, LThuong, PTLee, HSNdinteh, DTMbafor, JTFomum, ZTOh, WK Flavanones from the stem bark of Erythrina abyssinica. Bioorg Med Chem16:10356-62 (2008) 
 
Tyrosine-protein phosphatase non-receptor type 1
Name:Tyrosine-protein phosphatase non-receptor type 1
Type:Protein phosphatase
Mol. Mass.:49963.76
Organism:Homo sapiens (Human)
Description:Human recombinant GST-fusion PTP1B (1-435).
Residue:435
BDBM50274831
NameBDBM50274831
Synonyms:(S)-5,7,8'-trihydroxy-2',2'-dimethyl-5'-(3-methylbut-2-enyl)-2,6'-bichroman-4-one | CHEMBL458936
TypeSmall organic molecule
Emp. Form.C25H26O6
Mol. Mass.422.4703
SMILES[#6]\[#6](-[#6])=[#6]\[#6]-c1c(cc(-[#8])c2-[#8]C([#6])([#6])[#6]=[#6]-c12)-[#6@@H]-1-[#6]-[#6](=O)-c2c(-[#8])cc(-[#8])cc2-[#8]-1