Reaction Details
TargetCollagenase 3
LigandBDBM11548
Substrate/Competitorn/a
Meas. Tech.ChEMBL_495051 (CHEMBL1003623)
Ki 55±n/a nM
Citation DasGupta, SMurumkar, PRGiridhar, RYadav, MR Current perspective of TACE inhibitors: a review. Bioorg Med Chem17:444-59 (2009) 
 
Collagenase 3
Name:Collagenase 3
Type:Enzyme
Mol. Mass.:53808.06
Organism:Homo sapiens (Human)
Description:P45452
Residue:471
BDBM11548
NameBDBM11548
Synonyms:CHEMBL100570 N-hydroxy-2-{[4-(4-methoxyphenyl)phenyl]methyl}-1,1-dioxo-1,2-thiazolidine-3-carboxamide | Sultam Hydroxamate 15a
TypeSmall organic molecule
Emp. Form.C18H20N2O5S
Mol. Mass.376.427
SMILESCOc1ccc(cc1)-c1ccc(CN2C(CCS2(=O)=O)C(=O)NO)cc1