Reaction Details
TargetMultifunctional protein ADE2
LigandBDBM50247810
Substrate/Competitorn/a
Meas. Tech.ChEMBL_495249 (CHEMBL1003655)
IC50>100000±n/a nM
Citation Firestine, SMWu, WYoun, HDavisson, VJ Interrogating the mechanism of a tight binding inhibitor of AIR carboxylase. Bioorg Med Chem17:794-803 (2009) 
 
Multifunctional protein ADE2
Name:Multifunctional protein ADE2
Type:PROTEIN
Mol. Mass.:47244.84
Organism:Gallus gallus
Description:ChEMBL_495249
Residue:426
BDBM50247810
NameBDBM50247810
Synonyms:3-Nitro-1-(beta-D-ribofuranosyl)pyrrole 5'-phosphate | CHEMBL538120
TypeSmall organic molecule
Emp. Form.C9H11N2O9P
Mol. Mass.322.1665
SMILESO[C@H]1[C@@H](O)[C@@H](O[C@@H]1COP([O-])([O-])=O)n1ccc(c1)[N+]([O-])=O