Reaction Details
TargetMu-type opioid receptor
LigandBDBM21015
Substrate/Competitorn/a
Meas. Tech.ChEMBL_495343 (CHEMBL1007140)
EC50 45±n/a nM
Citation Li, GAschenbach, LCChen, JCassidy, MPStevens, DLGabra, BHSelley, DEDewey, WLWestkaemper, RBZhang, Y Design, synthesis, and biological evaluation of 6alpha- and 6beta-N-heterocyclic substituted naltrexamine derivatives as mu opioid receptor selective antagonists. J Med Chem52:1416-27 (2010) 
 
Mu-type opioid receptor
Name:Mu-type opioid receptor
Type:G Protein-Coupled Receptor (GPCR)
Mol. Mass.:44789.51
Organism:Homo sapiens (Human)
Description:P35372
Residue:400
BDBM21015
NameBDBM21015
Synonyms:(2S)-2-{2-[(2R)-2-[(2S)-2-amino-3-(4-hydroxyphenyl)propanamido]propanamido]-N-methylacetamido}-N-(2-hydroxyethyl)-3-phenylpropanamide CHEMBL38874 DAMGO US11492374, ID 2 [tyrosyl-3,5-3H(N)]-D-Ala2-Mephe4-glyol5-enkephalin
TypeAnalgesics
Emp. Form.C26H35N5O6
Mol. Mass.513.586
SMILESC[C@@H](NC(=O)[C@@H](N)Cc1ccc(O)cc1)C(=O)NCC(=O)N(C)[C@@H](Cc1ccccc1)C(=O)NCCO