Reaction Details
TargetKappa-type opioid receptor
LigandBDBM50292915
Substrate/Competitorn/a
Meas. Tech.ChEMBL_495340 (CHEMBL1006332)
Ki 1.8±n/a nM
Citation Li, GAschenbach, LCChen, JCassidy, MPStevens, DLGabra, BHSelley, DEDewey, WLWestkaemper, RBZhang, Y Design, synthesis, and biological evaluation of 6alpha- and 6beta-N-heterocyclic substituted naltrexamine derivatives as mu opioid receptor selective antagonists. J Med Chem52:1416-27 (2010) 
 
Kappa-type opioid receptor
Name:Kappa-type opioid receptor
Type:G Protein-Coupled Receptor (GPCR)
Mol. Mass.:42648.76
Organism:Homo sapiens (Human)
Description:P41145
Residue:380
BDBM50292915
NameBDBM50292915
Synonyms:17-Cyclopropylmethyl-3,14beta-dihydroxy-4,5r-epoxy-6alpha-[(3'-quinolyl)acetamido]morphinan | CHEMBL523382
TypeSmall organic molecule
Emp. Form.C30H31N3O4
Mol. Mass.497.5848
SMILESOc1ccc2C[C@H]3N(CC4CC4)CC[C@@]45[C@@H](Oc1c24)[C@H](CC[C@@]35O)NC(=O)c1cnc2ccccc2c1