Reaction Details
TargetCytochrome P450 3A4
LigandBDBM50292980
Substrate/Competitorn/a
Meas. Tech.ChEMBL_495543 (CHEMBL996822)
IC50 59000±n/a nM
Citation Westaway, SMBrown, SLFell, SCJohnson, CNMacPherson, DTMitchell, DJMyatt, JWStanway, SJSeal, JTStemp, GThompson, MLawless, KMcKay, FMuir, AIBarford, JMCluff, CMahmood, SRMatthews, KLMohamed, SSmith, BStevens, AJBolton, VJJarvie, EMSanger, GJ Discovery of N-(3-fluorophenyl)-1-[(4-([(3S)-3-methyl-1-piperazinyl]methyl)phenyl)acetyl]-4-piperidinamine (GSK962040), the first small molecule motilin receptor agonist clinical candidate. J Med Chem52:1180-9 (2009) 
 
Cytochrome P450 3A4
Name:Cytochrome P450 3A4
Type:Enzyme
Mol. Mass.:57349.57
Organism:Homo sapiens (Human)
Description:n/a
Residue:503
BDBM50292980
NameBDBM50292980
Synonyms:1-[(4-([(3R,5S)-3,5-Dimethyl-1-piperazinyl]methyl)phenyl)acetyl]-N-(4-fluorophenyl)-4-piperidinamine | CHEMBL474934
TypeSmall organic molecule
Emp. Form.C26H35FN4O
Mol. Mass.438.5807
SMILESC[C@H]1CN(Cc2ccc(CC(=O)N3CCC(CC3)Nc3ccc(F)cc3)cc2)C[C@@H](C)N1