Reaction Details
TargetCytochrome P450 2D6
LigandBDBM50247157
Substrate/Competitorn/a
Meas. Tech.ChEMBL_495126 (CHEMBL1008905)
IC50>23000±n/a nM
Citation Westaway, SMBrown, SLFell, SCJohnson, CNMacPherson, DTMitchell, DJMyatt, JWStanway, SJSeal, JTStemp, GThompson, MLawless, KMcKay, FMuir, AIBarford, JMCluff, CMahmood, SRMatthews, KLMohamed, SSmith, BStevens, AJBolton, VJJarvie, EMSanger, GJ Discovery of N-(3-fluorophenyl)-1-[(4-([(3S)-3-methyl-1-piperazinyl]methyl)phenyl)acetyl]-4-piperidinamine (GSK962040), the first small molecule motilin receptor agonist clinical candidate. J Med Chem52:1180-9 (2009) 
 
Cytochrome P450 2D6
Name:Cytochrome P450 2D6
Type:Protein
Mol. Mass.:55774.82
Organism:Homo sapiens (Human)
Description:P10635
Residue:497
BDBM50247157
NameBDBM50247157
Synonyms:(3-(4-(((3R,5S)-3,5-dimethylpiperazin-1-yl)methyl)phenyl)pyridin-2-yl)(4-(4-fluorophenylamino)piperidin-1-yl)methanone {3-[4-((3R,5S)-3,5-Dimethyl-piperazin-1-ylmethyl)-phenyl]-pyridin-2-yl}-[4-(4-fluoro-phenylamino)-piperidin-1-yl]-methanone
TypeSmall organic molecule
Emp. Form.C30H36FN5O
Mol. Mass.501.6381
SMILESC[C@H]1CN(Cc2ccc(cc2)-c2cccnc2C(=O)N2CCC(CC2)Nc2ccc(F)cc2)C[C@@H](C)N1