Reaction Details
TargetMotilin receptor
LigandBDBM50292982
Substrate/Competitorn/a
Meas. Tech.ChEMBL_495535 (CHEMBL1008005)
EC50 19.95±n/a nM
Citation Westaway, SMBrown, SLFell, SCJohnson, CNMacPherson, DTMitchell, DJMyatt, JWStanway, SJSeal, JTStemp, GThompson, MLawless, KMcKay, FMuir, AIBarford, JMCluff, CMahmood, SRMatthews, KLMohamed, SSmith, BStevens, AJBolton, VJJarvie, EMSanger, GJ Discovery of N-(3-fluorophenyl)-1-[(4-([(3S)-3-methyl-1-piperazinyl]methyl)phenyl)acetyl]-4-piperidinamine (GSK962040), the first small molecule motilin receptor agonist clinical candidate. J Med Chem52:1180-9 (2009) 
 
Motilin receptor
Name:Motilin receptor
Type:PROTEIN
Mol. Mass.:45365.95
Organism:Homo sapiens (Human)
Description:ChEMBL_122664
Residue:412
BDBM50292982
NameBDBM50292982
Synonyms:CHEMBL523933 | N-(3-Fluorophenyl)-1-[(4-([(3R)-3-methyl-1-piperazinyl]methyl)phenyl)acetyl]-4-piperidinamine
TypeSmall organic molecule
Emp. Form.C25H33FN4O
Mol. Mass.424.5541
SMILESC[C@@H]1CN(Cc2ccc(CC(=O)N3CCC(CC3)Nc3cccc(F)c3)cc2)CCN1