Reaction Details
TargetMotilin receptor
LigandBDBM50292984
Substrate/Competitorn/a
Meas. Tech.ChEMBL_495535 (CHEMBL1008005)
EC50 31.62±n/a nM
Citation Westaway, SMBrown, SLFell, SCJohnson, CNMacPherson, DTMitchell, DJMyatt, JWStanway, SJSeal, JTStemp, GThompson, MLawless, KMcKay, FMuir, AIBarford, JMCluff, CMahmood, SRMatthews, KLMohamed, SSmith, BStevens, AJBolton, VJJarvie, EMSanger, GJ Discovery of N-(3-fluorophenyl)-1-[(4-([(3S)-3-methyl-1-piperazinyl]methyl)phenyl)acetyl]-4-piperidinamine (GSK962040), the first small molecule motilin receptor agonist clinical candidate. J Med Chem52:1180-9 (2009) 
 
Motilin receptor
Name:Motilin receptor
Type:PROTEIN
Mol. Mass.:45365.95
Organism:Homo sapiens (Human)
Description:ChEMBL_122664
Residue:412
BDBM50292984
NameBDBM50292984
Synonyms:1-[2-(4-([(3R,5S)-3,5-Dimethyl-1-piperazinyl]methyl)phenyl)-2-methylpropanoyl]-N-(4-fluorophenyl)-4-piperidinamine | CHEMBL489479
TypeSmall organic molecule
Emp. Form.C28H39FN4O
Mol. Mass.466.6339
SMILESC[C@H]1CN(Cc2ccc(cc2)C(C)(C)C(=O)N2CCC(CC2)Nc2ccc(F)cc2)C[C@@H](C)N1