Reaction Details
TargetBroad substrate specificity ATP-binding cassette transporter ABCG2
LigandBDBM50293011
Substrate/Competitorn/a
Meas. Tech.ChEMBL_518478 (CHEMBL938929)
IC50 632±n/a nM
Citation Kühnle, MEgger, MMüller, CMahringer, ABernhardt, GFricker, GKönig, BBuschauer, A Potent and selective inhibitors of breast cancer resistance protein (ABCG2) derived from the p-glycoprotein (ABCB1) modulator tariquidar. J Med Chem52:1190-7 (2009) 
 
Broad substrate specificity ATP-binding cassette transporter ABCG2
Name:Broad substrate specificity ATP-binding cassette transporter ABCG2
Type:Multi-pass membrane protein; monomer or homodimer; disulfide-linked
Mol. Mass.:72329.48
Organism:Homo sapiens (Human)
Description:Q9UNQ0
Residue:655
BDBM50293011
NameBDBM50293011
Synonyms:CHEMBL501349 | Methyl 4-((4-(2-(6,7-dimethoxy-1,2,3,4-tetrahydroisoquinolin-2-yl)ethyl)phenyl)aminocarbonyl)-2-(pyrazine-2-carbonylamino)benzoate
TypeSmall organic molecule
Emp. Form.C33H33N5O6
Mol. Mass.595.645
SMILESCOC(=O)c1ccc(cc1NC(=O)c1cnccn1)C(=O)Nc1ccc(CCN2CCc3cc(OC)c(OC)cc3C2)cc1